{"text_format":"3","workbook":"xlsx","n_sheets":6,"sheets":["3 Monate Abrechnung","6 Monate Abrechnung","DatenDropdown","Vergütungstabelle A","Vergütungstabelle B","Vergütungstabelle C"],"not_rendered":{"comments":2},"read":"whole","date_system":"1900"}

{"sheet":"3 Monate Abrechnung","index":0,"n_rows":29,"n_cols":11,"rows_kept":29,"merged":[[0,0,0,2],[0,3,0,4],[1,0,1,2],[2,0,2,2],[3,0,3,2],[5,0,5,2],[6,2,6,3],[27,1,27,3],[28,1,28,7]]}
["Name:"]
["Heim:"]
["Vergütungstabelle:"]
["1. Vergütungsmonat endet am:",{"$nulls":4},"Schongrenze bis","2022-12-31",{"v":5000,"d":"5,000.00"}]
[{"$nulls":5},"Schongrenze ab","2023-01-01",{"v":10000,"d":"10,000.00"}]
["1. Vermögensstand IST"]
[null,"Tag der","Kontostand am Stichstag",null,"sonstiges oder",null,"überst.",{"$nulls":3},"mtl. Verg.-"]
["Monat","Vergütung","Giro","Spareinlagen","Verwahrkonto","Summe","Vermögen","Schongrenze",null,null,"anspruch"]
[1,{"$f":"IF($D$4>1,EDATE($D$4,0),\"\")","v":""},{"$nulls":3},{"$f":"SUM(C9:E9)","v":{"v":0,"d":"0.00"}},{"$f":"IF(SUM(C9:E9)>H9,SUM(F9-H9),\"nein\")","v":"nein"},{"$f":"IF(B9>$G$4,10000,5000)","v":{"v":10000,"d":"10,000.00"}},null,null,{"$f":"IF($D$3=\"B\",IF($D$2=\"JA\",'Vergütungstabelle B'!G21,'Vergütungstabelle B'!G23),IF($D$2=\"JA\",'Vergütungstabelle C'!G21,'Vergütungstabelle C'!G23))","v":{"v":211,"d":"211.00 €"}}]
[2,{"$f":"IF($D$4>1,EDATE($D$4,1),\"\")","v":""},{"$nulls":3},{"v":0,"d":"0.00"},{"$f":"IF(SUM(C10:E10)>H10,SUM(F10-H10),\"nein\")","v":"nein"},{"$f":"IF(B10>$G$4,10000,5000)","v":{"v":10000,"d":"10,000.00"}},null,null,{"$f":"IF($D$3=\"B\",IF($D$2=\"JA\",'Vergütungstabelle B'!G21,'Vergütungstabelle B'!G23),IF($D$2=\"JA\",'Vergütungstabelle C'!G21,'Vergütungstabelle C'!G23))","v":{"v":211,"d":"211.00 €"}}]
[3,{"$f":"IF($D$4>1,EDATE($D$4,2),\"\")","v":""},{"$nulls":3},{"v":0,"d":"0.00"},"nein",{"$f":"IF(B11>$G$4,10000,5000)","v":{"v":10000,"d":"10,000.00"}},null,null,{"$f":"IF($D$3=\"B\",IF($D$2=\"JA\",'Vergütungstabelle B'!G21,'Vergütungstabelle B'!G23),IF($D$2=\"JA\",'Vergütungstabelle C'!G21,'Vergütungstabelle C'!G23))","v":{"v":211,"d":"211.00 €"}}]
[4,{"$f":"IF($D$4>1,EDATE($D$4,3),\"\")","v":""},{"v":6129.54,"d":"6,129.54"},897.33,472.85,{"v":7499.72,"d":"7,499.72"},{"$f":"IF(SUM(C12:E12)>$K12,SUM(F12-$K12),\"nein\")","v":{"v":7499.72,"d":"7,499.72"}},{"$f":"IF($D$3=\"B\",IF($D$2=\"JA\",'Vergütungstabelle B'!G21,'Vergütungstabelle B'!G23),IF($D$2=\"JA\",'Vergütungstabelle C'!G21,'Vergütungstabelle C'!G23))","v":{"v":211,"d":"211.00 €"}},{"v":5000,"d":"5,000.00"}]
[5,{"$f":"IF($D$4>1,EDATE($D$4,4),\"\")","v":""},{"v":6594.78,"d":"6,594.78"},897.33,572.85,{"v":8064.96,"d":"8,064.96"},{"v":8064.96,"d":"8,064.96"},{"$f":"IF($D$3=\"B\",IF($D$2=\"JA\",'Vergütungstabelle B'!G21,'Vergütungstabelle B'!G23),IF($D$2=\"JA\",'Vergütungstabelle C'!G21,'Vergütungstabelle C'!G23))","v":{"v":211,"d":"211.00 €"}},{"v":5000,"d":"5,000.00"}]
[6,{"$f":"IF($D$4>1,EDATE($D$4,5),\"\")","v":""},{"v":6966.86,"d":"6,966.86"},897.34,399.03,{"v":8263.23,"d":"8,263.23"},{"v":8263.23,"d":"8,263.23"},{"$f":"IF($D$3=\"B\",IF($D$2=\"JA\",'Vergütungstabelle B'!G21,'Vergütungstabelle B'!G23),IF($D$2=\"JA\",'Vergütungstabelle C'!G21,'Vergütungstabelle C'!G23))","v":{"v":211,"d":"211.00 €"}},{"v":10000,"d":"10,000.00"}]
[]
["2. Vermögensstand nach Zuflusstheorie"]
[null,null,"Einkommen","Ausgaben","nicht","Vermögensstand","bereinigtes"]
[null,"Tag der","im Abrechnungs-","im Abrechnungs-","gedeckte","nach Abzug","überst."]
["Monat","Vergütung","monat","monat","Ausgaben","Einn./Ausg.","Vermögen","Status"]
[1,{"$f":"IF(B9>1,B9,\"\")","v":""},null,null,{"$f":"IF(D20>C20,D20-C20,0)","v":{"v":0,"d":"0.00"}},{"$f":"IF((F9-C20-E20)>0,F9-C20-E20,0)","v":{"v":0,"d":"0.00"}},{"$f":"IF(F20>$H9,SUM(F20-$H9),0)","v":{"v":0,"d":"0.00"}},{"$f":"IF(G20>1,\"vermögend\",\"mittellos\")","v":"mittellos"}]
[2,"",null,null,{"$f":"IF(D21>C21,D21-C21,0)","v":{"v":0,"d":"0.00"}},{"$f":"IF((F10-C21-E21)>0,F10-C21-E21,0)","v":{"v":0,"d":"0.00"}},{"$f":"IF(F21>$H10,SUM(F21-$H10),0)","v":{"v":0,"d":"0.00"}},{"$f":"IF(G21>1,\"vermögend\",\"mittellos\")","v":"mittellos"}]
[3,"",null,null,{"v":0,"d":"0.00"},{"v":0,"d":"0.00"},{"$f":"IF(F22>$H11,SUM(F22-$H11),0)","v":{"v":0,"d":"0.00"}},"mittellos"]
[4,"",{"v":1006.29,"d":"1,006.29"},747.91,{"v":0,"d":"0.00"},{"$f":"IF((F12-C23-H12-E23)>0,F12-C23-H12-E23,0)","v":{"v":6282.43,"d":"6,282.43"}},{"$f":"IF(F23>$I12,SUM(F23-$I12),0)","v":{"v":1282.4300000000003,"d":"1,282.43"}},"vermögend"]
[5,"",{"v":1333.15,"d":"1,333.15"},867.91,{"v":0,"d":"0.00"},{"v":6520.8099999999995,"d":"6,520.81"},{"v":1520.8099999999995,"d":"1,520.81"},"vermögend"]
[6,"",{"v":1120.29,"d":"1,120.29"},748.21,{"v":0,"d":"0.00"},{"v":6931.94,"d":"6,931.94"},{"v":0,"d":"0.00"},"mittellos"]
[]
[]
[null,"gelbe Felder ausfüllen"]
[null,"das Auswahlfeld \"Name:\" kann im Reiter \"DatenDropdown\" bearbeitet (Betreutenliste) werden "]

{"sheet":"6 Monate Abrechnung","index":1,"n_rows":25,"n_cols":11,"rows_kept":25,"merged":[[0,0,0,2],[0,3,0,4],[1,0,1,2],[2,0,2,2],[3,0,3,2],[5,0,5,2],[6,2,6,3]]}
["Name:"]
["Heim:",null,null,"JA"]
["Vergütungstabelle:",null,null,"B"]
["1. Vergütungsmonat endet am:",{"$nulls":4},"Schongrenze bis","2022-12-31",{"v":5000,"d":"5,000.00"}]
[{"$nulls":5},"Schongrenze ab","2023-01-01",{"v":10000,"d":"10,000.00"}]
["1. Vermögensstand IST"]
[null,"Tag der","Kontostand am Stichstag",null,"sonstiges oder",null,"überst.",{"$nulls":3},"mtl. Verg.-"]
["Monat","Vergütung","Giro","Spareinlagen","Verwahrkonto","Summe","Vermögen","Schongrenze",null,null,"anspruch"]
[1,{"$f":"IF($D$4>1,EDATE($D$4,0),\"\")","v":""},{"$nulls":3},{"$f":"SUM(C9:E9)","v":{"v":0,"d":"0.00"}},{"$f":"IF(SUM(C9:E9)>H9,SUM(F9-H9),\"nein\")","v":"nein"},{"$f":"IF(B9>$G$4,10000,5000)","v":{"v":10000,"d":"10,000.00"}},null,null,{"$f":"IF($D$3=\"B\",IF($D$2=\"JA\",'Vergütungstabelle B'!G21,'Vergütungstabelle B'!G23),IF($D$2=\"JA\",'Vergütungstabelle C'!G21,'Vergütungstabelle C'!G23))","v":{"v":96,"d":"96.00 €"}}]
[2,{"$f":"IF($D$4>1,EDATE($D$4,1),\"\")","v":""},{"$nulls":3},{"v":0,"d":"0.00"},{"$f":"IF(SUM(C10:E10)>H10,SUM(F10-H10),\"nein\")","v":"nein"},{"v":10000,"d":"10,000.00"},null,null,{"$f":"IF($D$3=\"B\",IF($D$2=\"JA\",'Vergütungstabelle B'!G21,'Vergütungstabelle B'!G23),IF($D$2=\"JA\",'Vergütungstabelle C'!G21,'Vergütungstabelle C'!G23))","v":{"v":96,"d":"96.00 €"}}]
[3,{"$f":"IF($D$4>1,EDATE($D$4,2),\"\")","v":""},{"$nulls":3},{"v":0,"d":"0.00"},"nein",{"v":10000,"d":"10,000.00"},null,null,{"$f":"IF($D$3=\"B\",IF($D$2=\"JA\",'Vergütungstabelle B'!G21,'Vergütungstabelle B'!G23),IF($D$2=\"JA\",'Vergütungstabelle C'!G21,'Vergütungstabelle C'!G23))","v":{"v":96,"d":"96.00 €"}}]
[4,{"$f":"IF($D$4>1,EDATE($D$4,3),\"\")","v":""},{"$nulls":3},{"v":0,"d":"0.00"},"nein",{"v":10000,"d":"10,000.00"},null,null,{"$f":"IF($D$3=\"B\",IF($D$2=\"JA\",'Vergütungstabelle B'!G21,'Vergütungstabelle B'!G23),IF($D$2=\"JA\",'Vergütungstabelle C'!G21,'Vergütungstabelle C'!G23))","v":{"v":96,"d":"96.00 €"}}]
[5,{"$f":"IF($D$4>1,EDATE($D$4,4),\"\")","v":""},{"$nulls":3},{"v":0,"d":"0.00"},"nein",{"v":10000,"d":"10,000.00"},null,null,{"$f":"IF($D$3=\"B\",IF($D$2=\"JA\",'Vergütungstabelle B'!G21,'Vergütungstabelle B'!G23),IF($D$2=\"JA\",'Vergütungstabelle C'!G21,'Vergütungstabelle C'!G23))","v":{"v":96,"d":"96.00 €"}}]
[6,{"$f":"IF($D$4>1,EDATE($D$4,5),\"\")","v":""},{"$nulls":3},{"v":0,"d":"0.00"},"nein",{"v":10000,"d":"10,000.00"},null,null,{"$f":"IF($D$3=\"B\",IF($D$2=\"JA\",'Vergütungstabelle B'!G21,'Vergütungstabelle B'!G23),IF($D$2=\"JA\",'Vergütungstabelle C'!G21,'Vergütungstabelle C'!G23))","v":{"v":96,"d":"96.00 €"}}]
[]
["2. Vermögensstand nach Zuflusstheorie"]
[null,null,"Einkommen","Ausgaben","nicht","Vermögensstand","bereinigtes"]
[null,"Tag der","im Abrechnungs-","im Abrechnungs-","gedeckte","nach Abzug","überst."]
["Monat","Vergütung","monat","monat","Ausgaben","Einn./Ausg.","Vermögen","Status"]
[1,{"$f":"IF(B9>1,B9,\"\")","v":""},null,null,{"$f":"IF(D20>C20,D20-C20,0)","v":{"v":0,"d":"0.00"}},{"$f":"IF((F9-C20-E20)>0,F9-C20-E20,0)","v":{"v":0,"d":"0.00"}},{"$f":"IF(F20>$H9,SUM(F20-$H9),0)","v":{"v":0,"d":"0.00"}},{"$f":"IF(G20>1,\"vermögend\",\"mittellos\")","v":"mittellos"}]
[2,"",null,null,{"$f":"IF(D21>C21,D21-C21,0)","v":{"v":0,"d":"0.00"}},{"$f":"IF((F10-C21-E21)>0,F10-C21-E21,0)","v":{"v":0,"d":"0.00"}},{"v":0,"d":"0.00"},{"$f":"IF(G21>1,\"vermögend\",\"mittellos\")","v":"mittellos"}]
[3,"",null,null,{"v":0,"d":"0.00"},{"v":0,"d":"0.00"},{"v":0,"d":"0.00"},"mittellos"]
[4,"",null,null,{"v":0,"d":"0.00"},{"v":0,"d":"0.00"},{"v":0,"d":"0.00"},"mittellos"]
[5,"",null,null,{"v":0,"d":"0.00"},{"v":0,"d":"0.00"},{"v":0,"d":"0.00"},"mittellos"]
[6,"",null,null,{"v":0,"d":"0.00"},{"v":0,"d":"0.00"},{"v":0,"d":"0.00"},"mittellos"]

{"sheet":"DatenDropdown","index":2,"n_rows":32,"n_cols":5,"rows_kept":32}
[{"$nulls":4},"Betreutenliste:"]
["B","JA","Januar","1900-01-01"]
["C","NEIN","Februar","1900-01-02"]
[null,null,"März","1900-01-03"]
[null,null,"April","1900-01-04"]
[null,null,"Mai","1900-01-05"]
[null,null,"Juni","1900-01-06"]
[null,null,"Juli","1900-01-07"]
[null,null,"August","1900-01-08"]
[null,null,"September","1900-01-09"]
[null,null,"Oktober","1900-01-10"]
[null,null,"November","1900-01-11"]
[null,null,"Dezember","1900-01-12"]
[{"$nulls":3},"1900-01-13"]
[{"$nulls":3},"1900-01-14"]
[{"$nulls":3},"1900-01-15"]
[{"$nulls":3},"1900-01-16"]
[{"$nulls":3},"1900-01-17"]
[{"$nulls":3},"1900-01-18"]
[{"$nulls":3},"1900-01-19"]
[{"$nulls":3},"1900-01-20"]
[{"$nulls":3},"1900-01-21"]
[{"$nulls":3},"1900-01-22"]
[{"$nulls":3},"1900-01-23"]
[{"$nulls":3},"1900-01-24"]
[{"$nulls":3},"1900-01-25"]
[{"$nulls":3},"1900-01-26"]
[{"$nulls":3},"1900-01-27"]
[{"$nulls":3},"1900-01-28"]
[{"$nulls":3},"1900-01-29"]
[{"$nulls":3},"1900-01-30"]
[{"$nulls":3},"1900-01-31"]

{"sheet":"Vergütungstabelle A","index":3,"n_rows":23,"n_cols":7,"rows_kept":23,"hidden":true,"merged":[[1,0,2,0],[1,2,2,2],[1,4,2,4],[1,5,2,5],[3,0,6,0],[3,2,4,2],[3,3,4,3],[5,2,6,2],[5,3,6,3],[7,0,10,0],[7,2,8,2],[7,3,8,3],[9,2,10,2],[9,3,10,3],[11,0,14,0],[11,2,12,2],[11,3,12,3],[13,2,14,2],[13,3,14,3],[15,0,18,0],[15,2,16,2],[15,3,16,3],[17,2,18,2],[17,3,18,3],[19,0,22,0],[19,1,22,1],[19,2,20,2],[19,3,20,3],[21,2,22,2],[21,3,22,3]]}
["Vergütungstabelle A"]
["Nr.","Dauer der","Nr.","Gewöhnlicher","Nr.","Vermögensstatus","monatliche"]
[null,"Betreuung",null,"Aufenthaltsort",null,null,"Pauschale"]
["A1","In den ersten","A1.1","stationäre Einrichtung oder gleichgestellte ambulant betreute Wohnform","A1.1.1","mittellos",{"v":194,"d":"194.00 €"}]
[null,"drei Monaten",null,null,"A1.1.2","nicht mittellos",{"v":200,"d":"200.00 €"}]
[null,null,"A1.2","andere Wohnform","A1.2.1","mittellos",{"v":208,"d":"208.00 €"}]
[{"$nulls":4},"A1.2.2","nicht mittellos",{"v":298,"d":"298.00 €"}]
["A2","Im vierten bis","A2.1","stationäre Einrichtung oder gleichgestellte ambulant betreute Wohnform","A2.1.1","mittellos",{"v":129,"d":"129.00 €"}]
[null,"sechsten Monat",null,null,"A2.1.2","nicht mittellos",{"v":158,"d":"158.00 €"}]
[null,null,"A2.2","andere Wohnform","A2.2.1","mittellos",{"v":170,"d":"170.00 €"}]
[{"$nulls":4},"A2.2.2","nicht mittellos",{"v":208,"d":"208.00 €"}]
["A3","Im siebten bis","A3.1","stationäre Einrichtung oder gleichgestellte ambulant betreute Wohnform","A3.1.1","mittellos",{"v":124,"d":"124.00 €"}]
[null,"zwölften Monat",null,null,"A3.1.2","nicht mittellos",{"v":140,"d":"140.00 €"}]
[null,null,"A3.2","andere Wohnform","A3.2.1","mittellos",{"v":151,"d":"151.00 €"}]
[{"$nulls":4},"A3.2.2","nicht mittellos",{"v":192,"d":"192.00 €"}]
["A4","Im 13. bis","A4.1","stationäre Einrichtung oder gleichgestellte ambulant betreute Wohnform","A4.1.1","mittellos",{"v":87,"d":"87.00 €"}]
[null,"24. Monat",null,null,"A4.1.2","nicht mittellos",{"v":91,"d":"91.00 €"}]
[null,null,"A4.2","andere Wohnform","A4.2.1","mittellos",{"v":122,"d":"122.00 €"}]
[{"$nulls":4},"A4.2.2","nicht mittellos",{"v":158,"d":"158.00 €"}]
["A5","Ab dem 25. Monat","A5.1","stationäre Einrichtung oder gleichgestellte ambulant betreute Wohnform","A5.1.1","mittellos",{"v":62,"d":"62.00 €"}]
[{"$nulls":4},"A5.1.2","nicht mittellos",{"v":78,"d":"78.00 €"}]
[null,null,"A5.2","andere Wohnform","A5.2.1","mittellos",{"v":105,"d":"105.00 €"}]
[{"$nulls":4},"A5.2.2","nicht mittellos",{"v":130,"d":"130.00 €"}]

{"sheet":"Vergütungstabelle B","index":4,"n_rows":23,"n_cols":7,"rows_kept":23,"merged":[[1,0,2,0],[1,2,2,2],[1,4,2,4],[1,5,2,5],[3,0,6,0],[3,2,4,2],[3,3,4,3],[5,2,6,2],[5,3,6,3],[7,0,10,0],[7,2,8,2],[7,3,8,3],[9,2,10,2],[9,3,10,3],[11,0,14,0],[11,2,12,2],[11,3,12,3],[13,2,14,2],[13,3,14,3],[15,0,18,0],[15,2,16,2],[15,3,16,3],[17,2,18,2],[17,3,18,3],[19,0,22,0],[19,1,22,1],[19,2,20,2],[19,3,20,3],[21,2,22,2],[21,3,22,3]]}
["Vergütungstabelle B"]
["Nr.","Dauer der","Nr.","Gewöhnlicher","Nr.","Vermögensstatus","monatliche"]
[null,"Betreuung",null,"Aufenthaltsort",null,null,"Pauschale"]
["B1","In den ersten","B1.1","stationäre Einrichtung oder gleichgestellte ambulant betreute Wohnform","B1.1.1","mittellos",{"v":241,"d":"241.00 €"}]
[null,"drei Monaten",null,null,"B1.1.2","nicht mittellos",{"v":249,"d":"249.00 €"}]
[null,null,"B1.2","andere Wohnform","B1.2.1","mittellos",{"v":258,"d":"258.00 €"}]
[{"$nulls":4},"B1.2.2","nicht mittellos",{"v":370,"d":"370.00 €"}]
["B2","Im vierten bis","B2.1","stationäre Einrichtung oder gleichgestellte ambulant betreute Wohnform","B2.1.1","mittellos",{"v":158,"d":"158.00 €"}]
[null,"sechsten Monat",null,null,"B2.1.2","nicht mittellos",{"v":196,"d":"196.00 €"}]
[null,null,"B2.2","andere Wohnform","B2.2.1","mittellos",{"v":211,"d":"211.00 €"}]
[{"$nulls":4},"B2.2.2","nicht mittellos",{"v":258,"d":"258.00 €"}]
["B3","Im siebten bis","B3.1","stationäre Einrichtung oder gleichgestellte ambulant betreute Wohnform","B3.1.1","mittellos",{"v":154,"d":"154.00 €"}]
[null,"zwölften Monat",null,null,"B3.1.2","nicht mittellos",{"v":174,"d":"174.00 €"}]
[null,null,"B3.2","andere Wohnform","B3.2.1","mittellos",{"v":188,"d":"188.00 €"}]
[{"$nulls":4},"B3.2.2","nicht mittellos",{"v":238,"d":"238.00 €"}]
["B4","Im 13. bis","B4.1","stationäre Einrichtung oder gleichgestellte ambulant betreute Wohnform","B4.1.1","mittellos",{"v":107,"d":"107.00 €"}]
[null,"24. Monat",null,null,"B4.1.2","nicht mittellos",{"v":113,"d":"113.00 €"}]
[null,null,"B4.2","andere Wohnform","B4.2.1","mittellos",{"v":151,"d":"151.00 €"}]
[{"$nulls":4},"B4.2.2","nicht mittellos",{"v":196,"d":"196.00 €"}]
["B5","Ab dem 25. Monat","B5.1","stationäre Einrichtung oder gleichgestellte ambulant betreute Wohnform","B5.1.1","mittellos",{"v":78,"d":"78.00 €"}]
[{"$nulls":4},"B5.1.2","nicht mittellos",{"v":96,"d":"96.00 €"}]
[null,null,"B5.2","andere Wohnform","B5.2.1","mittellos",{"v":130,"d":"130.00 €"}]
[{"$nulls":4},"B5.2.2","nicht mittellos",{"v":161,"d":"161.00 €"}]

{"sheet":"Vergütungstabelle C","index":5,"n_rows":23,"n_cols":7,"rows_kept":23,"merged":[[1,0,2,0],[1,2,2,2],[1,4,2,4],[1,5,2,5],[3,0,6,0],[3,2,4,2],[3,3,4,3],[5,2,6,2],[5,3,6,3],[7,0,10,0],[7,2,8,2],[7,3,8,3],[9,2,10,2],[9,3,10,3],[11,0,14,0],[11,2,12,2],[11,3,12,3],[13,2,14,2],[13,3,14,3],[15,0,18,0],[15,2,16,2],[15,3,16,3],[17,2,18,2],[17,3,18,3],[19,0,22,0],[19,1,22,1],[19,2,20,2],[19,3,20,3],[21,2,22,2],[21,3,22,3]]}
["Vergütungstabelle C"]
["Nr.","Dauer der","Nr.","Gewöhnlicher","Nr.","Vermögensstatus","monatliche"]
[null,"Betreuung",null,"Aufenthaltsort",null,null,"Pauschale"]
["C1","In den ersten","C1.1","stationäre Einrichtung oder gleichgestellte ambulant betreute Wohnform","C1.1.1","mittellos",{"v":317,"d":"317.00 €"}]
[null,"drei Monaten",null,null,"C1.1.2","nicht mittellos",{"v":327,"d":"327.00 €"}]
[null,null,"C1.2","andere Wohnform","C1.2.1","mittellos",{"v":339,"d":"339.00 €"}]
[{"$nulls":4},"C1.2.2","nicht mittellos",{"v":486,"d":"486.00 €"}]
["C2","Im vierten bis","C2.1","stationäre Einrichtung oder gleichgestellte ambulant betreute Wohnform","C2.1.1","mittellos",{"v":208,"d":"208.00 €"}]
[null,"sechsten Monat",null,null,"C2.1.2","nicht mittellos",{"v":257,"d":"257.00 €"}]
[null,null,"C2.2","andere Wohnform","C2.2.1","mittellos",{"v":277,"d":"277.00 €"}]
[{"$nulls":4},"C2.2.2","nicht mittellos",{"v":339,"d":"339.00 €"}]
["C3","Im siebten bis","C3.1","stationäre Einrichtung oder gleichgestellte ambulant betreute Wohnform","C3.1.1","mittellos",{"v":202,"d":"202.00 €"}]
[null,"zwölften Monat",null,null,"C3.1.2","nicht mittellos",{"v":229,"d":"229.00 €"}]
[null,null,"C3.2","andere Wohnform","C3.2.1","mittellos",{"v":246,"d":"246.00 €"}]
[{"$nulls":4},"C3.2.2","nicht mittellos",{"v":312,"d":"312.00 €"}]
["C4","Im 13. bis","C4.1","stationäre Einrichtung oder gleichgestellte ambulant betreute Wohnform","C4.1.1","mittellos",{"v":141,"d":"141.00 €"}]
[null,"24. Monat",null,null,"C4.1.2","nicht mittellos",{"v":149,"d":"149.00 €"}]
[null,null,"C4.2","andere Wohnform","C4.2.1","mittellos",{"v":198,"d":"198.00 €"}]
[{"$nulls":4},"C4.2.2","nicht mittellos",{"v":257,"d":"257.00 €"}]
["C5","Ab dem 25. Monat","C5.1","stationäre Einrichtung oder gleichgestellte ambulant betreute Wohnform","C5.1.1","mittellos",{"v":102,"d":"102.00 €"}]
[{"$nulls":4},"C5.1.2","nicht mittellos",{"v":127,"d":"127.00 €"}]
[null,null,"C5.2","andere Wohnform","C5.2.1","mittellos",{"v":171,"d":"171.00 €"}]
[{"$nulls":4},"C5.2.2","nicht mittellos",{"v":211,"d":"211.00 €"}]